The UFZ services GitLab and Mattermost will be unavailable on Monday, December 06 from 06:00 AM to 08:00 AM due to maintenance work.

- fixed little bug in module of pFUnit for foss2018b

13 jobs for !16 with 4-create-ci-workflow in 6 minutes and 37 seconds
latest detached
Status Name Job ID Coverage
  Info
passed show-env-vars #69170

00:00:02

 
  Test
failed coverage-gcc73 #69182

00:01:25

passed test-gfortran102MPI-debug #69175

00:02:01

failed test-gfortran102MPI-release #69174

00:02:39

passed test-gfortran73MPI-debug #69177

00:01:57

passed test-gfortran73MPI-release #69176

00:02:11

passed test-gfortran83MPI-debug #69173

00:02:29

failed test-gfortran83MPI-release #69172

00:02:18

failed test-intel18-debug #69179

00:03:33

passed test-intel18-release #69178

00:04:28

passed test-intel19MPI-release #69181

00:04:03

passed test-intel19-release #69180

00:03:52

passed test-nag62-release #69171

00:01:40

 
Name Stage Failure
failed
test-intel18-debug Test
[ 51%] Built target test_mo_standard_score
make: *** [all] Error 2
Uploading artifacts for failed job
Uploading artifacts...
Runtime platform
arch=amd64 os=linux pid=99722 revision=775dd39d version=13.8.0
build_debug/Testing/Temporary: found 1 matching files and directories

Uploading artifacts as "archive" to coordinator... ok
id=69179 responseStatus=201 Created token=s3oMquZN
Cleaning up file based variables
ERROR: Job failed: exit status 1
failed
coverage-gcc73 Test
make: *** [FORCES_coverage_CI] Error 2
Uploading artifacts for failed job
Uploading artifacts...
Runtime platform
arch=amd64 os=linux pid=21564 revision=775dd39d version=13.8.0
WARNING: build_debug/FORCES_coverage_CI.info: no matching files
WARNING: build_debug/FORCES_coverage_CI: no matching files
ERROR: No files to upload
Cleaning up file based variables
ERROR: Job failed: exit status 1
failed
test-gfortran102MPI-release Test
Errors while running CTest
make: *** [test] Error 8
Uploading artifacts for failed job
Uploading artifacts...
Runtime platform
arch=amd64 os=linux pid=18153 revision=775dd39d version=13.8.0
build_release/Testing/Temporary: found 4 matching files and directories

Uploading artifacts as "archive" to coordinator... ok
id=69174 responseStatus=201 Created token=5XAD197q
Cleaning up file based variables
ERROR: Job failed: exit status 1
failed
test-gfortran83MPI-release Test
Errors while running CTest
make: *** [test] Error 8
Uploading artifacts for failed job
Uploading artifacts...
Runtime platform
arch=amd64 os=linux pid=14677 revision=775dd39d version=13.8.0
build_release/Testing/Temporary: found 4 matching files and directories

Uploading artifacts as "archive" to coordinator... ok
id=69172 responseStatus=201 Created token=1STYh37H
Cleaning up file based variables
ERROR: Job failed: exit status 1