The UFZ services GitLab and Mattermost will be unavailable on Monday, December 06 from 06:00 AM to 08:00 AM due to maintenance work.

Merge branch '4-create-ci-workflow' into '4-create-ci-workflow'

Resolve "Create CI workflow"

See merge request chs/lightweight_fortran_lib!16
13 jobs for !21 with 4-create-ci-workflow in 5 minutes and 25 seconds (queued for 3 seconds)
latest detached
Status Name Job ID Coverage
  Info
passed show-env-vars #69231

00:00:02

 
  Test
failed coverage-gcc73 #69243

00:02:06

passed test-gfortran102MPI-debug #69236

00:02:23

failed test-gfortran102MPI-release #69235

00:02:54

passed test-gfortran73MPI-debug #69238

00:02:20

passed test-gfortran73MPI-release #69237

00:02:31

passed test-gfortran83MPI-debug #69234

00:02:48

failed test-gfortran83MPI-release #69233

00:02:53

failed test-intel18-debug #69240

00:02:12

passed test-intel18-release #69239

00:03:13

passed test-intel19MPI-release #69242

00:02:54

passed test-intel19-release #69241

00:02:40

passed test-nag62-release #69232

00:01:56

 
Name Stage Failure
failed
test-gfortran102MPI-release Test
Errors while running CTest
make: *** [test] Error 8
Uploading artifacts for failed job
Uploading artifacts...
Runtime platform
arch=amd64 os=linux pid=20526 revision=775dd39d version=13.8.0
build_release/Testing/Temporary: found 4 matching files and directories

Uploading artifacts as "archive" to coordinator... ok
id=69235 responseStatus=201 Created token=FbNtJzNc
Cleaning up file based variables
ERROR: Job failed: exit status 1
failed
coverage-gcc73 Test
make: *** [FORCES_coverage_CI] Error 2
Uploading artifacts for failed job
Uploading artifacts...
Runtime platform
arch=amd64 os=linux pid=14410 revision=775dd39d version=13.8.0
WARNING: build_debug/FORCES_coverage_CI.info: no matching files
WARNING: build_debug/FORCES_coverage_CI: no matching files
ERROR: No files to upload
Cleaning up file based variables
ERROR: Job failed: exit status 1
failed
test-intel18-debug Test
[ 57%] Built target test_mo_utils
make: *** [all] Error 2
Uploading artifacts for failed job
Uploading artifacts...
Runtime platform
arch=amd64 os=linux pid=27493 revision=775dd39d version=13.8.0
build_debug/Testing/Temporary: found 1 matching files and directories

Uploading artifacts as "archive" to coordinator... ok
id=69240 responseStatus=201 Created token=TLF3jbG6
Cleaning up file based variables
ERROR: Job failed: exit status 1
failed
test-gfortran83MPI-release Test
Errors while running CTest
make: *** [test] Error 8
Uploading artifacts for failed job
Uploading artifacts...
Runtime platform
arch=amd64 os=linux pid=18156 revision=775dd39d version=13.8.0
build_release/Testing/Temporary: found 4 matching files and directories

Uploading artifacts as "archive" to coordinator... ok
id=69233 responseStatus=201 Created token=JV88Eka5
Cleaning up file based variables
ERROR: Job failed: exit status 1