The UFZ services GitLab and Mattermost will be unavailable on Monday, December 06 from 06:00 AM to 08:00 AM due to maintenance work.

unit-test: complete test_mo_standard_score

13 jobs for pfunit_tests in 45 minutes and 33 seconds (queued for 2 seconds)
Status Name Job ID Coverage
  Info
passed show-env-vars #169135

00:00:03

 
  Test
passed coverage #169147

00:05:50

34.5%
passed test-gfortran102MPI-debug #169140

00:05:30

passed test-gfortran102MPI-release #169139

00:05:33

passed test-gfortran73MPI-debug #169142

00:01:45

passed test-gfortran73MPI-release #169141

00:01:47

passed test-gfortran83MPI-debug #169138

00:03:41

passed test-gfortran83MPI-release #169137

00:03:42

failed test-intel18-debug #169144

00:43:41

passed test-intel18-release #169143

00:11:49

passed test-intel19MPI-release #169146

00:07:59

passed test-intel19-release #169145

00:08:06

failed test-nag62-release #169136

00:02:46

 
Name Stage Failure
failed
test-intel18-debug Test
The following tests FAILED:
10 - test_mo_mcmc (Timeout)
Errors while running CTest
make: *** [test] Fehler 8
Uploading artifacts...
Runtime platform arch=amd64 os=linux pid=141648 revision=a8a019e0 version=12.3.0
build_debug/Testing/Temporary: found 4 matching files

Uploading artifacts to coordinator... ok
id=169144 responseStatus=201 Created token=4ojyDyLY
ERROR: Job failed: exit status 1
failed
test-nag62-release Test
The following tests FAILED:
13 - test_mo_netcdf (Child aborted)
Errors while running CTest
make: *** [test] Fehler 8
Uploading artifacts...
Runtime platform arch=amd64 os=linux pid=36038 revision=a8a019e0 version=12.3.0
build_release/Testing/Temporary: found 4 matching files

Uploading artifacts to coordinator... ok
id=169136 responseStatus=201 Created token=qVpy7vJq
ERROR: Job failed: exit status 1