From June 06th, all CI Jobs will run on federated Helmholtz infrastructure by default. If you need UFZ-internal resources, add the tag "ufz-internal" to your CI configuration or use a custom GitLab Runner (e.g. EVE). If you have any questions, feel free to contact us!

Curious to learn more about GitLab CI? Join this free course on 14-16 June. Register now

- something is wrong with getAttributesNames in test case... print diagnostics

13 jobs for 30-feature-to-read-all-attributes-of-a-given-netcdf-type in 11 minutes and 1 second (queued for 4 seconds)
Name Stage Failure
failed
test-intel18-release Test
The following tests FAILED:
14 - test_mo_netcdf (Failed)
Errors while running CTest
make: *** [test] Fehler 8
Uploading artifacts...
Runtime platform arch=amd64 os=linux pid=8666 revision=a8a019e0 version=12.3.0
build_release/Testing/Temporary: found 4 matching files

Uploading artifacts to coordinator... ok
id=197138 responseStatus=201 Created token=yrfJq5jC
ERROR: Job failed: exit status 1
failed
test-intel18-debug Test
[ 81%] Built target test_mo_nml
[ 81%] Built target test_mo_append
[ 81%] Built target test_mo_errormeasures
make: *** [all] Fehler 2
Uploading artifacts...
Runtime platform arch=amd64 os=linux pid=8178 revision=a8a019e0 version=12.3.0
build_debug/Testing/Temporary: found 1 matching files

Uploading artifacts to coordinator... ok
id=197139 responseStatus=201 Created token=QdsmHsRQ
ERROR: Job failed: exit status 1
failed
test-intel19MPI-release Test
The following tests FAILED:
14 - test_mo_netcdf (Failed)
Errors while running CTest
make: *** [test] Fehler 8
Uploading artifacts...
Runtime platform arch=amd64 os=linux pid=8080 revision=a8a019e0 version=12.3.0
build_release/Testing/Temporary: found 4 matching files

Uploading artifacts to coordinator... ok
id=197141 responseStatus=201 Created token=47TAeMEY
ERROR: Job failed: exit status 1
failed
coverage Test
make[3]: *** [CMakeFiles/coverage] Fehler 8
make[2]: *** [CMakeFiles/coverage.dir/all] Fehler 2
make[1]: *** [CMakeFiles/coverage.dir/rule] Fehler 2
make: *** [coverage] Fehler 2
Uploading artifacts...
Runtime platform arch=amd64 os=linux pid=3746 revision=a8a019e0 version=12.3.0
WARNING: build_debug/coverage: no matching files
ERROR: No files to upload
ERROR: Job failed: exit status 1
failed
test-intel19-release Test
[ 37%] Built target test_mo_cli
[ 37%] Built target test_mo_message
[ 37%] Built target test_mo_utils
make: *** [all] Fehler 2
Uploading artifacts...
Runtime platform arch=amd64 os=linux pid=268355 revision=a8a019e0 version=12.3.0
build_release/Testing/Temporary: found 1 matching files

Uploading artifacts to coordinator... ok
id=197140 responseStatus=201 Created token=D5aJe4AY
ERROR: Job failed: exit status 1
failed
test-gfortran102MPI-release Test
The following tests FAILED:
14 - test_mo_netcdf (Failed)
Errors while running CTest
make: *** [test] Fehler 8
Uploading artifacts...
Runtime platform arch=amd64 os=linux pid=265223 revision=a8a019e0 version=12.3.0
build_release/Testing/Temporary: found 4 matching files

Uploading artifacts to coordinator... ok
id=197134 responseStatus=201 Created token=PstfJUy3
ERROR: Job failed: exit status 1
failed
test-gfortran102MPI-debug Test
The following tests FAILED:
14 - test_mo_netcdf (Failed)
Errors while running CTest
make: *** [test] Fehler 8
Uploading artifacts...
Runtime platform arch=amd64 os=linux pid=264671 revision=a8a019e0 version=12.3.0
build_debug/Testing/Temporary: found 4 matching files

Uploading artifacts to coordinator... ok
id=197135 responseStatus=201 Created token=8kfsc7h1
ERROR: Job failed: exit status 1
failed
test-gfortran83MPI-release Test
The following tests FAILED:
14 - test_mo_netcdf (Failed)
Errors while running CTest
make: *** [test] Fehler 8
Uploading artifacts...
Runtime platform arch=amd64 os=linux pid=259363 revision=a8a019e0 version=12.3.0
build_release/Testing/Temporary: found 4 matching files

Uploading artifacts to coordinator... ok
id=197132 responseStatus=201 Created token=TKNHNUGq
ERROR: Job failed: exit status 1
failed
test-gfortran83MPI-debug Test
The following tests FAILED:
14 - test_mo_netcdf (Failed)
Errors while running CTest
make: *** [test] Fehler 8
Uploading artifacts...
Runtime platform arch=amd64 os=linux pid=259223 revision=a8a019e0 version=12.3.0
build_debug/Testing/Temporary: found 4 matching files

Uploading artifacts to coordinator... ok
id=197133 responseStatus=201 Created token=DdZatMnb
ERROR: Job failed: exit status 1
failed
test-nag62-release Test
The following tests FAILED:
14 - test_mo_netcdf (Failed)
Errors while running CTest
make: *** [test] Fehler 8
Uploading artifacts...
Runtime platform arch=amd64 os=linux pid=255949 revision=a8a019e0 version=12.3.0
build_release/Testing/Temporary: found 4 matching files

Uploading artifacts to coordinator... ok
id=197131 responseStatus=201 Created token=sJLonupo
ERROR: Job failed: exit status 1