The UFZ services GitLab and Mattermost will be unavailable on Monday, January 24 from 06:00 AM to 08:00 AM due to maintenance work.

Want to get a quick-start introduction to Shell, Git and GitLab? Join the next beginners course on 28/31 January. Register now!

Merge branch 'v6_add_cli' into 'v6_develop'

Add CLI and Interface module

See merge request !91
25 jobs for v6_develop in 138 minutes and 4 seconds (queued for 7 minutes and 24 seconds)
Status Name Job ID Coverage
  Info
passed show-env-vars #180055

00:00:01

 
  Build
passed cmake-gfortran73 #180057

00:13:13

passed cmake-gfortran73MPI #180058

00:07:04

passed cmake-gfortran83 #180059

00:10:38

passed cmake-gfortran83MPI #180060

00:06:46

passed cmake-intel18 #180061

00:35:10

passed cmake-intel18MPI #180062

00:23:53

passed cmake-intel19 #180063

00:26:20

passed cmake-intel19MPI #180064

00:16:01

passed cmake-nagfor62 #180056

00:01:49

 
  Valgrind
passed valgrind-gfortran83 #180066

00:04:33

failed valgrind-intel19 #180067

01:36:32

failed valgrind-nagfor62 #180065

00:00:23

 
  Check Cases
failed check-gfortran73 #180070

00:00:52

failed check-gfortran73MPI #180071

00:01:27

passed check-gfortran83 #180072

00:03:13

passed check-gfortran83MPI #180073

00:01:23

passed check-intel18 #180074

00:04:59

passed check-intel18MPI #180075

00:01:10

passed check-intel19 #180076

00:04:49

passed check-intel19MPI #180077

00:01:48

failed check-nagfor62 #180068

00:00:16

failed check-nagfor62DEBUG #180069

00:00:11

 
  Code Analysis
failed coverage-gfortran73 #180079

00:02:12

failed unittest-gfortran83 #180078

00:03:18

 
Name Stage Failure
failed
valgrind-intel19 Valgrind There has been a timeout failure or the job got stuck. Check your timeout limits or try again
  OUTPUT: saved netCDF file for domain         1
to test_domain/output_b1/
--252319-- REDIR: 0x5857f70 (libc.so.6:__GI_strnlen) redirected to 0x4032de0 (__GI_strnlen)
Failed to close file: test_domain_2/output/mRM_Fluxes_States.nc



NetCDF: HDF error

1
failed
coverage-gfortran73 Code Analysis
make[3]: *** [src/CMakeFiles/mhm_lib.dir/mHM/mo_mhm_interface.F90.o] Fehler 1
make[2]: *** [src/CMakeFiles/mhm_lib.dir/all] Fehler 2
make[1]: *** [CMakeFiles/mhm_coverage_CI.dir/rule] Fehler 2
make: *** [mhm_coverage_CI] Fehler 2
Uploading artifacts...
Runtime platform arch=amd64 os=linux pid=247754 revision=a8a019e0 version=12.3.0
WARNING: coverage: no matching files
ERROR: No files to upload
ERROR: Job failed: exit status 1
failed
unittest-gfortran83 Code Analysis

Total Test time (real) = 0.61 sec

The following tests FAILED:
2 - test_grid (Failed)
3 - test_pet (NUMERICAL)
6 - test_soil_moisture (NUMERICAL)
Errors while running CTest
ERROR: Job failed: exit status 1
failed
check-gfortran73MPI Check Cases
Traceback (most recent call last):
File "run_mhm_checks.py", line 643, in <module>
raise AssertionError("mHM checks were not successful.")
AssertionError: mHM checks were not successful.
Uploading artifacts...
Runtime platform arch=amd64 os=linux pid=200133 revision=a8a019e0 version=12.3.0
check/logs/: found 15 matching files

Uploading artifacts to coordinator... ok
id=180071 responseStatus=201 Created token=gdWeWy2x
ERROR: Job failed: exit status 1
failed
check-gfortran73 Check Cases
Traceback (most recent call last):
File "run_mhm_checks.py", line 643, in <module>
raise AssertionError("mHM checks were not successful.")
AssertionError: mHM checks were not successful.
Uploading artifacts...
Runtime platform arch=amd64 os=linux pid=185551 revision=a8a019e0 version=12.3.0
check/logs/: found 53 matching files

Uploading artifacts to coordinator... ok
id=180070 responseStatus=201 Created token=c7iqXarW
ERROR: Job failed: exit status 1
failed
check-nagfor62DEBUG Check Cases
Traceback (most recent call last):
File "run_mhm_checks.py", line 643, in <module>
raise AssertionError("mHM checks were not successful.")
AssertionError: mHM checks were not successful.
Uploading artifacts...
Runtime platform arch=amd64 os=linux pid=177671 revision=a8a019e0 version=12.3.0
check/logs/: found 10 matching files

Uploading artifacts to coordinator... ok
id=180069 responseStatus=201 Created token=sJxGGCsz
ERROR: Job failed: exit status 1
failed
check-nagfor62 Check Cases
Traceback (most recent call last):
File "run_mhm_checks.py", line 643, in <module>
raise AssertionError("mHM checks were not successful.")
AssertionError: mHM checks were not successful.
Uploading artifacts...
Runtime platform arch=amd64 os=linux pid=173858 revision=a8a019e0 version=12.3.0
check/logs/: found 14 matching files

Uploading artifacts to coordinator... ok
id=180068 responseStatus=201 Created token=zgK6gDwi
ERROR: Job failed: exit status 1
failed
valgrind-nagfor62 Valgrind
==150424==    definitely lost: 0 bytes in 0 blocks
==150424== indirectly lost: 0 bytes in 0 blocks
==150424== possibly lost: 0 bytes in 0 blocks
==150424== still reachable: 819,002 bytes in 5,326 blocks
==150424== suppressed: 0 bytes in 0 blocks
==150424==
==150424== ERROR SUMMARY: 0 errors from 0 contexts (suppressed: 0 from 0)
bash: Zeile 113: 150424 Abgebrochen valgrind --tool=memcheck --leak-check=full --show-leak-kinds=all --track-origins=yes --verbose ./mhm_debug
ERROR: Job failed: exit status 1