Merge branch 'mhm_evel_refactor' into 'v6_develop'

Interface update No. 2: refactoring mhm_eval

See merge request !94
25 jobs for v6_develop in 64 minutes and 16 seconds (queued for 5 minutes and 2 seconds)
latest
Name Stage Failure
failed
check-intel19 Check Cases
Traceback (most recent call last):
File "run_mhm_checks.py", line 685, in <module>
raise AssertionError("mHM checks were not successful.")
AssertionError: mHM checks were not successful.
Uploading artifacts...
Runtime platform arch=amd64 os=linux pid=228430 revision=a8a019e0 version=12.3.0
check/logs/: found 53 matching files

Uploading artifacts to coordinator... ok
id=239786 responseStatus=201 Created token=25bxqsbw
ERROR: Job failed: exit status 1
failed
check-intel18 Check Cases
Traceback (most recent call last):
File "run_mhm_checks.py", line 685, in <module>
raise AssertionError("mHM checks were not successful.")
AssertionError: mHM checks were not successful.
Uploading artifacts...
Runtime platform arch=amd64 os=linux pid=227423 revision=a8a019e0 version=12.3.0
check/logs/: found 53 matching files

Uploading artifacts to coordinator... ok
id=239784 responseStatus=201 Created token=xhtEj1KD
ERROR: Job failed: exit status 1
failed
check-gfortran83 Check Cases
Traceback (most recent call last):
File "run_mhm_checks.py", line 685, in <module>
raise AssertionError("mHM checks were not successful.")
AssertionError: mHM checks were not successful.
Uploading artifacts...
Runtime platform arch=amd64 os=linux pid=186713 revision=a8a019e0 version=12.3.0
check/logs/: found 53 matching files

Uploading artifacts to coordinator... ok
id=239782 responseStatus=201 Created token=mw7KHg7H
ERROR: Job failed: exit status 1
failed
check-intel19MPI Check Cases
Traceback (most recent call last):
File "run_mhm_checks.py", line 685, in <module>
raise AssertionError("mHM checks were not successful.")
AssertionError: mHM checks were not successful.
Uploading artifacts...
Runtime platform arch=amd64 os=linux pid=168535 revision=a8a019e0 version=12.3.0
check/logs/: found 15 matching files

Uploading artifacts to coordinator... ok
id=239787 responseStatus=201 Created token=p5t_-J9E
ERROR: Job failed: exit status 1
failed
check-intel18MPI Check Cases
Traceback (most recent call last):
File "run_mhm_checks.py", line 685, in <module>
raise AssertionError("mHM checks were not successful.")
AssertionError: mHM checks were not successful.
Uploading artifacts...
Runtime platform arch=amd64 os=linux pid=166456 revision=a8a019e0 version=12.3.0
check/logs/: found 15 matching files

Uploading artifacts to coordinator... ok
id=239785 responseStatus=201 Created token=XrSGjzZc
ERROR: Job failed: exit status 1
failed
unittest-gfortran83 Code Analysis

Total Test time (real) = 0.40 sec

The following tests FAILED:
2 - test_grid (Failed)
3 - test_pet (NUMERICAL)
6 - test_soil_moisture (NUMERICAL)
Errors while running CTest
ERROR: Job failed: exit status 1
failed
check-gfortran83MPI Check Cases
Traceback (most recent call last):
File "run_mhm_checks.py", line 685, in <module>
raise AssertionError("mHM checks were not successful.")
AssertionError: mHM checks were not successful.
Uploading artifacts...
Runtime platform arch=amd64 os=linux pid=152354 revision=a8a019e0 version=12.3.0
check/logs/: found 15 matching files

Uploading artifacts to coordinator... ok
id=239783 responseStatus=201 Created token=z6HAfpjR
ERROR: Job failed: exit status 1
failed
valgrind-intel19 Valgrind
==104634==    by 0x538FE7: mo_startup_mp_mhm_initialize_ (mo_startup.f90:99)
==104634== by 0x41BA88: mo_mhm_interface_mp_mhm_interface_init_ (mo_mhm_interface.F90:136)
==104634== by 0x417500: MAIN__ (mhm_driver.f90:101)
==104634== by 0x417351: main (in /gpfs1/public/mhm_runner/_F29omLL/mhm/mhm/v6_develop/valgrind-intel19/mhm_debug)
==104634== Address 0x1ffea7af48 is on thread 1's stack
==104634== in frame #0, created by mo_mpr_data_array_upscale_mp_execute_upscalehelper_ (mo_mpr_data_array_upscale.F90:553)
==104634==
==104634== ERROR SUMMARY: 10000000 errors from 67 contexts (suppressed: 0 from 0)
ERROR: Job failed: exit status 1
failed
check-gfortran73 Check Cases
Traceback (most recent call last):
File "run_mhm_checks.py", line 685, in <module>
raise AssertionError("mHM checks were not successful.")
AssertionError: mHM checks were not successful.
Uploading artifacts...
Runtime platform arch=amd64 os=linux pid=143611 revision=a8a019e0 version=12.3.0
check/logs/: found 53 matching files

Uploading artifacts to coordinator... ok
id=239780 responseStatus=201 Created token=zo5qWXrd
ERROR: Job failed: exit status 1
failed
check-gfortran73MPI Check Cases
Traceback (most recent call last):
File "run_mhm_checks.py", line 685, in <module>
raise AssertionError("mHM checks were not successful.")
AssertionError: mHM checks were not successful.
Uploading artifacts...
Runtime platform arch=amd64 os=linux pid=141003 revision=a8a019e0 version=12.3.0
check/logs/: found 15 matching files

Uploading artifacts to coordinator... ok
id=239781 responseStatus=201 Created token=aLzbvGtb
ERROR: Job failed: exit status 1
failed
check-nagfor62DEBUG Check Cases
Traceback (most recent call last):
File "run_mhm_checks.py", line 685, in <module>
raise AssertionError("mHM checks were not successful.")
AssertionError: mHM checks were not successful.
Uploading artifacts...
Runtime platform arch=amd64 os=linux pid=102669 revision=a8a019e0 version=12.3.0
check/logs/: found 10 matching files

Uploading artifacts to coordinator... ok
id=239779 responseStatus=201 Created token=4Vs72ycu
ERROR: Job failed: exit status 1
failed
check-nagfor62 Check Cases
    s = self._decoder.decode(s, final=False)
File "/global/apps/mhm_checks/mhm_env/lib/python3.8/codecs.py", line 322, in decode
(result, consumed) = self._buffer_decode(data, self.errors, final)
UnicodeDecodeError: 'utf-8' codec can't decode byte 0x8e in position 28: invalid start byte
Uploading artifacts...
Runtime platform arch=amd64 os=linux pid=61875 revision=a8a019e0 version=12.3.0
check/logs/: found 7 matching files

Uploading artifacts to coordinator... ok
id=239778 responseStatus=201 Created token=Sgp6fCGq
ERROR: Job failed: exit status 1