The UFZ services GitLab and Mattermost will be unavailable on Monday, January 24 from 06:00 AM to 08:00 AM due to maintenance work.

Want to get a quick-start introduction to Shell, Git and GitLab? Join the next beginners course on 28/31 January. Register now!

- changed units of horizon thickness passed to mhm so it [mm] again (check case 08)

25 jobs for mpr_finalize in 55 minutes and 41 seconds (queued for 16 minutes and 53 seconds)
Status Name Job ID Coverage
  Info
passed show-env-vars #194217

00:00:01

 
  Build
passed cmake-gfortran73 #194219

00:08:37

passed cmake-gfortran73MPI #194220

00:05:33

passed cmake-gfortran83 #194221

00:10:02

passed cmake-gfortran83MPI #194222

00:06:33

passed cmake-intel18 #194223

00:24:58

passed cmake-intel18MPI #194224

00:15:58

passed cmake-intel19 #194225

00:20:55

passed cmake-intel19MPI #194226

00:12:34

passed cmake-nagfor62 #194218

00:02:44

 
  Valgrind
failed valgrind-gfortran83 #194228

00:05:58

failed valgrind-intel19 #194229

00:06:16

failed valgrind-nagfor62 #194227

00:15:37

 
  Check Cases
failed check-gfortran73 #194232

00:12:48

failed check-gfortran73MPI #194233

00:02:05

failed check-gfortran83 #194234

00:12:23

failed check-gfortran83MPI #194235

00:01:42

failed check-intel18 #194236

00:23:56

failed check-intel18MPI #194237

00:02:45

failed check-intel19 #194238

00:24:14

failed check-intel19MPI #194239

00:02:46

failed check-nagfor62 #194230

00:03:25

failed check-nagfor62DEBUG #194231

00:03:14

 
  Code Analysis
failed coverage-gfortran73 #194241

00:01:50

failed unittest-gfortran83 #194240

00:01:04

 
Name Stage Failure
failed
check-intel18 Check Cases
Traceback (most recent call last):
File "run_mhm_checks.py", line 685, in <module>
raise AssertionError("mHM checks were not successful.")
AssertionError: mHM checks were not successful.
Uploading artifacts...
Runtime platform arch=amd64 os=linux pid=16172 revision=a8a019e0 version=12.3.0
check/logs/: found 53 matching files

Uploading artifacts to coordinator... ok
id=194236 responseStatus=201 Created token=29Ck6YY3
ERROR: Job failed: exit status 1
failed
check-intel19 Check Cases
Traceback (most recent call last):
File "run_mhm_checks.py", line 685, in <module>
raise AssertionError("mHM checks were not successful.")
AssertionError: mHM checks were not successful.
Uploading artifacts...
Runtime platform arch=amd64 os=linux pid=13735 revision=a8a019e0 version=12.3.0
check/logs/: found 53 matching files

Uploading artifacts to coordinator... ok
id=194238 responseStatus=201 Created token=i9PpVHyp
ERROR: Job failed: exit status 1
failed
coverage-gfortran73 Code Analysis
make[3]: *** [src/CMakeFiles/mhm_lib.dir/mHM/mo_mhm_interface.F90.o] Fehler 1
make[2]: *** [src/CMakeFiles/mhm_lib.dir/all] Fehler 2
make[1]: *** [CMakeFiles/mhm_coverage_CI.dir/rule] Fehler 2
make: *** [mhm_coverage_CI] Fehler 2
Uploading artifacts...
Runtime platform arch=amd64 os=linux pid=260855 revision=a8a019e0 version=12.3.0
WARNING: coverage: no matching files
ERROR: No files to upload
ERROR: Job failed: exit status 1
failed
check-gfortran83 Check Cases
Traceback (most recent call last):
File "run_mhm_checks.py", line 685, in <module>
raise AssertionError("mHM checks were not successful.")
AssertionError: mHM checks were not successful.
Uploading artifacts...
Runtime platform arch=amd64 os=linux pid=260507 revision=a8a019e0 version=12.3.0
check/logs/: found 53 matching files

Uploading artifacts to coordinator... ok
id=194234 responseStatus=201 Created token=7TDxeuLT
ERROR: Job failed: exit status 1
failed
valgrind-intel19 Valgrind
==244857==    by 0x530936: mo_startup_mp_mhm_initialize_ (mo_startup.f90:110)
==244857== by 0x41BA90: mo_mhm_interface_mp_mhm_interface_init_ (mo_mhm_interface.F90:141)
==244857== by 0x417500: MAIN__ (mhm_driver.f90:101)
==244857== by 0x417351: main (in /gpfs1/public/mhm_runner/privat/Tv2zYHgV/muellese/mhm/mpr_finalize/valgrind-intel19/mhm_debug)
==244857== Address 0x1ffeaa2528 is on thread 1's stack
==244857== in frame #0, created by mo_mpr_data_array_upscale_mp_execute_upscalehelper_ (mo_mpr_data_array_upscale.f90:553)
==244857==
==244857== ERROR SUMMARY: 10000000 errors from 66 contexts (suppressed: 0 from 0)
ERROR: Job failed: exit status 1
failed
check-gfortran73 Check Cases
Traceback (most recent call last):
File "run_mhm_checks.py", line 685, in <module>
raise AssertionError("mHM checks were not successful.")
AssertionError: mHM checks were not successful.
Uploading artifacts...
Runtime platform arch=amd64 os=linux pid=256492 revision=a8a019e0 version=12.3.0
check/logs/: found 53 matching files

Uploading artifacts to coordinator... ok
id=194232 responseStatus=201 Created token=oKqJ3Yba
ERROR: Job failed: exit status 1
failed
check-intel19MPI Check Cases
Traceback (most recent call last):
File "run_mhm_checks.py", line 685, in <module>
raise AssertionError("mHM checks were not successful.")
AssertionError: mHM checks were not successful.
Uploading artifacts...
Runtime platform arch=amd64 os=linux pid=243628 revision=a8a019e0 version=12.3.0
check/logs/: found 15 matching files

Uploading artifacts to coordinator... ok
id=194239 responseStatus=201 Created token=ABv3fbFE
ERROR: Job failed: exit status 1
failed
check-intel18MPI Check Cases
Traceback (most recent call last):
File "run_mhm_checks.py", line 685, in <module>
raise AssertionError("mHM checks were not successful.")
AssertionError: mHM checks were not successful.
Uploading artifacts...
Runtime platform arch=amd64 os=linux pid=239625 revision=a8a019e0 version=12.3.0
check/logs/: found 15 matching files

Uploading artifacts to coordinator... ok
id=194237 responseStatus=201 Created token=RjtM_Yz2
ERROR: Job failed: exit status 1
failed
unittest-gfortran83 Code Analysis

Total Test time (real) = 0.35 sec

The following tests FAILED:
2 - test_grid (Failed)
3 - test_pet (NUMERICAL)
6 - test_soil_moisture (NUMERICAL)
Errors while running CTest
ERROR: Job failed: exit status 1
failed
valgrind-nagfor62 Valgrind
==182864== LEAK SUMMARY:
==182864== definitely lost: 0 bytes in 0 blocks
==182864== indirectly lost: 0 bytes in 0 blocks
==182864== possibly lost: 0 bytes in 0 blocks
==182864== still reachable: 627,103 bytes in 3,415 blocks
==182864== suppressed: 0 bytes in 0 blocks
==182864==
==182864== ERROR SUMMARY: 0 errors from 0 contexts (suppressed: 0 from 0)
ERROR: Job failed: exit status 1
failed
check-gfortran83MPI Check Cases
Traceback (most recent call last):
File "run_mhm_checks.py", line 685, in <module>
raise AssertionError("mHM checks were not successful.")
AssertionError: mHM checks were not successful.
Uploading artifacts...
Runtime platform arch=amd64 os=linux pid=232619 revision=a8a019e0 version=12.3.0
check/logs/: found 15 matching files

Uploading artifacts to coordinator... ok
id=194235 responseStatus=201 Created token=ii6yBcEs
ERROR: Job failed: exit status 1
failed
check-gfortran73MPI Check Cases
Traceback (most recent call last):
File "run_mhm_checks.py", line 685, in <module>
raise AssertionError("mHM checks were not successful.")
AssertionError: mHM checks were not successful.
Uploading artifacts...
Runtime platform arch=amd64 os=linux pid=229695 revision=a8a019e0 version=12.3.0
check/logs/: found 15 matching files

Uploading artifacts to coordinator... ok
id=194233 responseStatus=201 Created token=C656D4xi
ERROR: Job failed: exit status 1
failed
check-nagfor62DEBUG Check Cases
Traceback (most recent call last):
File "run_mhm_checks.py", line 685, in <module>
raise AssertionError("mHM checks were not successful.")
AssertionError: mHM checks were not successful.
Uploading artifacts...
Runtime platform arch=amd64 os=linux pid=226685 revision=a8a019e0 version=12.3.0
check/logs/: found 10 matching files

Uploading artifacts to coordinator... ok
id=194231 responseStatus=201 Created token=CdCxCwPL
ERROR: Job failed: exit status 1
failed
check-nagfor62 Check Cases
Traceback (most recent call last):
File "run_mhm_checks.py", line 685, in <module>
raise AssertionError("mHM checks were not successful.")
AssertionError: mHM checks were not successful.
Uploading artifacts...
Runtime platform arch=amd64 os=linux pid=216476 revision=a8a019e0 version=12.3.0
check/logs/: found 14 matching files

Uploading artifacts to coordinator... ok
id=194230 responseStatus=201 Created token=abr18wX7
ERROR: Job failed: exit status 1
failed
valgrind-gfortran83 Valgrind
==187978==    by 0x56D279: __mo_mpr_data_array_MOD_execute (mo_mpr_data_array.f90:311)
==187978== by 0x5152F4: __mo_mhm_mpr_interface_MOD_call_mpr (mo_mhm_mpr_interface.f90:129)
==187978== by 0x4441B1: __mo_startup_MOD_mhm_initialize (mo_startup.f90:110)
==187978== by 0x407AED: __mo_mhm_interface_MOD_mhm_interface_init (mo_mhm_interface.F90:141)
==187978== by 0x40613F: MAIN__ (mhm_driver.f90:101)
==187978== by 0x4061AC: main (mhm_driver.f90:81)
==187978==
==187978== ERROR SUMMARY: 687 errors from 18 contexts (suppressed: 0 from 0)
ERROR: Job failed: exit status 1