The UFZ services GitLab and Mattermost will be unavailable on Monday, October 25 from 06:00 AM to 08:00 AM due to maintenance work.

WIP - started complicated functions

2 jobs for ipol_reidx_fixes in 4 minutes and 55 seconds
latest
Status Job ID Name Coverage
  Test
failed #62004
test:python37

00:04:55

failed #62005
test:python38

00:04:03

 
Name Stage Failure
failed
test:python37 Test
FAILED test/funcs/test_proc_functions.py::test_rollingInterpolateMissing[flagger0]
FAILED test/funcs/test_proc_functions.py::test_interpolateMissing[flagger0]
FAILED test/funcs/test_proc_functions.py::test_transform[flagger0] - Attribut...
FAILED test/funcs/test_proc_functions.py::test_resample[flagger0] - Attribute...
FAILED test/funcs/test_proc_functions.py::test_interpolateGrid[flagger0] - At...
FAILED test/funcs/test_proc_functions.py::test_offsetCorrecture[flagger0] - A...
====== 183 failed, 293 passed, 4 skipped, 1 xfailed, 7 warnings in 38.59s ======
Cleaning up file based variables
ERROR: Job failed: exit code 1
failed
test:python38 Test
FAILED test/funcs/test_proc_functions.py::test_rollingInterpolateMissing[flagger0]
FAILED test/funcs/test_proc_functions.py::test_interpolateMissing[flagger0]
FAILED test/funcs/test_proc_functions.py::test_transform[flagger0] - Attribut...
FAILED test/funcs/test_proc_functions.py::test_resample[flagger0] - Attribute...
FAILED test/funcs/test_proc_functions.py::test_interpolateGrid[flagger0] - At...
FAILED test/funcs/test_proc_functions.py::test_offsetCorrecture[flagger0] - A...
====== 183 failed, 293 passed, 4 skipped, 1 xfailed, 7 warnings in 33.92s ======
Cleaning up file based variables
ERROR: Job failed: exit code 1