reader: fixed the loss of function names through the config interface

2 jobs for develop in 7 minutes and 8 seconds (queued for 3 seconds)
latest
Status Job ID Name Coverage
  Test
failed #152253
fuzzy

00:07:08

failed #152256
testLib

00:03:48

 
Name Stage Failure
failed
fuzzy Test
FAILED tests/fuzzy/test_functions.py::test_breaks_flagJumps - IndexError: ind...
FAILED tests/fuzzy/test_masking.py::test_maskingMasksData - TypeError: _maskD...
FAILED tests/fuzzy/test_masking.py::test_dataMutationPreventsUnmasking - Type...
FAILED tests/fuzzy/test_masking.py::test_flagsMutationPreventsUnmasking - Typ...
FAILED tests/fuzzy/test_masking.py::test_reshapingPreventsUnmasking - TypeErr...
FAILED tests/fuzzy/test_masking.py::test_unmaskingInvertsMasking - TypeError:...
============= 6 failed, 8 passed, 72 warnings in 358.04s (0:05:58) =============
Cleaning up file based variables
ERROR: Job failed: exit code 1
failed
testLib Test
FAILED tests/lib/test_rolling.py::test_forward_num[median-{'window': 0, 'min_periods': None, 'center': True}]
FAILED tests/lib/test_rolling.py::test_forward_num[var-{'window': 0, 'min_periods': None, 'center': True}]
FAILED tests/lib/test_rolling.py::test_forward_num[std-{'window': 0, 'min_periods': None, 'center': True}]
FAILED tests/lib/test_rolling.py::test_forward_num[min-{'window': 0, 'min_periods': None, 'center': True}]
FAILED tests/lib/test_rolling.py::test_forward_num[max-{'window': 0, 'min_periods': None, 'center': True}]
FAILED tests/lib/test_rolling.py::test_forward_num[cov-{'window': 0, 'min_periods': None, 'center': True}]
========== 335 failed, 23877 passed, 82 warnings in 156.36s (0:02:36) ==========
Cleaning up file based variables
ERROR: Job failed: exit code 1